http://purl.org/np/RAUxGBVFN0uqJ0eUJVULv1MNd75lQDpjWyBNcuPwrKXzM
type: Nanopublication
has assertion: assertion
has provenance: provenance
has publication info: pubinfo
created: 2021-05-21T13:24:22.983+02:00
creator: https://orcid.org/0000-0002-1267-0234
introduces: R4RM4M workshop

sig
has algorithm: RSA

R4RM4M workshop
type: Class
subclass of: M4M-workshop
definition: Metadata for Machines (M4M) workshop to Review for Reuse (R4R) of created resources organized by GO FAIR